RDF description of 祭り・イベント実施主体
primary topic: 祭り・イベント実施主体

祭り・イベント実施主体
type: TerminologyConcept
in scheme: TerminologyConceptScheme
top concept of: TerminologyConceptScheme
broader: Ta00577
created: 2017-12-01
description: 祭り・イベントの実施主体。祭り・イベントとは、内水面漁業地域に関連した地域振興、活性化の目的及び慣例的な行事として、定期的に行われているものをいう。