RDF description of 栽培形態区分
primary topic: 栽培形態区分

栽培形態区分
type: TerminologyConcept
description: 作物の栽培形態による区分。栽培形態には、露地栽培、施設・養液栽培（固型培地）、施設・養液栽培（非固型培地）、施設・養液以外栽培がある。
created: 2017-12-01
broader: Ta00605
in scheme: TerminologyConceptScheme
top concept of: TerminologyConceptScheme