今後の事業展開
type: TerminologyConcept
description: 「事業の拡大を図りたい」、「廃業したい」や「現状を維持したい」など、今後の事業展開について、事業主が考えていること、予定していること。
created: 2017-12-01
broader: Ta00549
top concept of: TerminologyConceptScheme
in scheme: TerminologyConceptScheme

RDF description of 今後の事業展開
primary topic: 今後の事業展開