骨塩量測定実施件数
type: TerminologyConcept
description: ＤＥＸＡ法による腰椎撮影、ＭＤ法、ＳＥＸＡ法等及び超音波法による骨塩定量検査の実施件数。
created: 2017-12-01
broader: Ta00403
top concept of: TerminologyConceptScheme
in scheme: TerminologyConceptScheme

RDF description of 骨塩量測定実施件数
primary topic: 骨塩量測定実施件数