RDF description of 高齢者等設備工事の有無
primary topic: 高齢者等設備工事の有無

高齢者等設備工事の有無
type: TerminologyConcept
description: 高齢者等のための設備工事の有無。建て替え、新築、購入又は増改築の際に、世帯の意思で高齢者等のための設備の工事をした場合を含める。現在、その世帯に高齢者等がいなくても、将来を見越して工事をした場合を含める。
created: 2017-12-01
broader: Ta00569
in scheme: TerminologyConceptScheme
top concept of: TerminologyConceptScheme