購入熱量
type: TerminologyConcept
description: 購入量を熱量の単位（kJ、MJなど）で表したもの。購入とは、工場及び工場が契約の主体となって借り入れている倉庫又は保管場所に、他企業から購入すること。直接輸入したものを含む。
created: 2017-12-01
broader: Ta00307
top concept of: TerminologyConceptScheme
in scheme: TerminologyConceptScheme

RDF description of 購入熱量
primary topic: 購入熱量