購入電力量
type: TerminologyConcept
description: 購入量を電力量の単位（kWhなど）で表したもの。事業所、工場が電気事業者及び他企業から実際に購入した電力量、並びに同一企業内の他の事業所から受け入れた電力量。共同で受電を行っている場合は、調査対象である事業所、工場のみの受電量。
created: 2017-12-01
broader: Ta00316
top concept of: TerminologyConceptScheme
in scheme: TerminologyConceptScheme

RDF description of 購入電力量
primary topic: 購入電力量