講師数
type: TerminologyConcept
description: 講師として発令されている者の数。講師とは、教諭・助教諭に準ずる職務に従事する者又は教授・准教授に準ずる職務に従事する者をいう。
created: 2017-12-01
broader: Ta00122
top concept of: TerminologyConceptScheme
in scheme: TerminologyConceptScheme

RDF description of 講師数
primary topic: 講師数