RDF description of 校長数
primary topic: 校長数

校長数
type: TerminologyConcept
in scheme: TerminologyConceptScheme
top concept of: TerminologyConceptScheme
broader: Ta00122
created: 2017-12-01
description: 学校教育法により小学校・中学校・高等学校・中等教育学校・特別支援学校・専修学校・各種学校に配置されている「校長」の数。校長は校務をつかさどり、所属職員を監督する。