校長・教頭・教諭・助教諭・講師数A
type: TerminologyConcept
description: 学校に在籍している校長・教頭・教諭・助教諭・講師の数。【平成25年5月 「校（園）長・副校（園）長・教頭・主幹教諭・指導教諭・教諭・助教諭・講師数」に定義内容を変更】
created: 2017-12-01
broader: Ta00122
top concept of: TerminologyConceptScheme
in scheme: TerminologyConceptScheme

RDF description of 校長・教頭・教諭・助教諭・講師数A
primary topic: 校長・教頭・教諭・助教諭・講師数A