広告宣伝費
type: TerminologyConcept
description: 商品・サービス・会社などを広く一般に知らせるために行う、新聞・テレビなどの広告媒体への広告や宣伝にかかる費用の額。
created: 2017-12-01
broader: Ta00072
in scheme: TerminologyConceptScheme
top concept of: TerminologyConceptScheme

RDF description of 広告宣伝費
primary topic: 広告宣伝費