目的別工事分類
type: TerminologyConcept
description: 当該建設工事の事業別の区分（「01河川工事」～「26他に分類されない工事」の26種類）。
created: 2017-12-01
broader: Ta00652
in scheme: TerminologyConceptScheme
top concept of: TerminologyConceptScheme

RDF description of 目的別工事分類
primary topic: 目的別工事分類