受注形式
type: TerminologyConcept
description: 当該建設工事の受注形式（「1単独受注工事」、「2ＪＶ工事を代表者として受注」、「3ＪＶ工事を代表者以外の構成員として受注」の３種類）。
created: 2017-12-01
broader: Ta00652
top concept of: TerminologyConceptScheme
in scheme: TerminologyConceptScheme

RDF description of 受注形式
primary topic: 受注形式