工事種類
type: TerminologyConcept
description: 当該建設工事の種類（「01住宅・同設備工事」～「12機械装置等工事」の12種類）。
created: 2017-12-01
broader: Ta00652
in scheme: TerminologyConceptScheme
top concept of: TerminologyConceptScheme

RDF description of 工事種類
primary topic: 工事種類