工事の変更区分
type: TerminologyConcept
description: 調査対象の建築物が着工後に工事の変更があった場合、１．１年以上未着工、２．工事中止、３．用途変更、４．構造変更の該当する番号を記入する。
created: 2017-12-01
broader: Ta00652
in scheme: TerminologyConceptScheme
top concept of: TerminologyConceptScheme

RDF description of 工事の変更区分
primary topic: 工事の変更区分