口座自動振替により支払ったものの種類・品名等
type: TerminologyConcept
created: 2017-12-01
description: 銀行又は他の金融機関の口座自動振替を利用して、公共料金の支払や、クレジットカード、掛買い、月賦などで購入した品物の代金の支払、その他の各種の支払を行っている場合の支払ったものの種類、品名等。口座自動振替とは、公共料金などの支払者である世帯、受取者である企業及びその仲介者である銀行などの金融機関の三者間の契約によって、その都度現金又は為替などにより店頭に払込みをしなくても、定期的にその世帯の預貯金口座から企業側に自動的に支払われる制度。
narrower: si323020085
narrower: si243020036
narrower: si242010050
narrower: si243010036
top concept of: TerminologyConceptScheme
narrower: si324020085
narrower: si242020050
in scheme: TerminologyConceptScheme
broader: Ta00580
narrower: si323010072

RDF description of 口座自動振替により支払ったものの種類・品名等
primary topic: 口座自動振替により支払ったものの種類・品名等