公立学校の補助金収入額
type: TerminologyConcept
description: 都道府県立の大学及び短期大学においては国からの補助金、市町村立の大学及び短期大学においては都道府県からの補助金の額。なお、公立大学法人の設置する大学及び短期大学においては、国または都道府県からの補助金（運営費交付金を含める。）をいう。
created: 2017-12-01
broader: Ta00068
top concept of: TerminologyConceptScheme
in scheme: TerminologyConceptScheme

RDF description of 公立学校の補助金収入額
primary topic: 公立学校の補助金収入額