RDF description of 後継者の有無_2
primary topic: 後継者の有無_2

後継者の有無_2
type: TerminologyConcept
description: 過去１年間に漁業（自家漁業であるか否かは問わない）に従事した人のうち、将来、自家漁業の経営主になる予定の人の有無。
created: 2017-12-01
broader: Ta00578
in scheme: TerminologyConceptScheme
top concept of: TerminologyConceptScheme