RDF description of 固定資産の細分等
primary topic: 固定資産の細分等

固定資産の細分等
type: TerminologyConcept
in scheme: TerminologyConceptScheme
top concept of: TerminologyConceptScheme
broader: Ta00653
created: 2017-12-01
description: 植物・動物、車両・運搬具・機械・装置・建物・構築物及び土地を除く固定資産（事務機器、電気機器等）の細分等。パソコン、複写機等の名称。