個人会員数
type: TerminologyConcept
description: 自社カードの会員数（契約数）（※２）のうち、個人の会員。（※２）「会員数（契約数）」とは、クレジットカードの会員契約を行っている有効契約数をいい、個人カード発行枚数からいわゆる契約会員に附帯する家族会員カード発行枚数を除いた数。
created: 2017-12-01
broader: Ta00145
in scheme: TerminologyConceptScheme
top concept of: TerminologyConceptScheme

RDF description of 個人会員数
primary topic: 個人会員数