RDF description of 言語聴覚士の常勤換算数
primary topic: 言語聴覚士の常勤換算数

言語聴覚士の常勤換算数
type: TerminologyConcept
description: 施設が直接雇い入れた者、派遣労働者、出向者、一般の従事者と同様の勤務状況にある家族従事者のうち、その施設で定めた１週間の勤務時間により常勤に換算した言語聴覚士の数。言語聴覚士とは、言語聴覚士の免許を有する者をいう。
created: 2017-12-01
broader: Ta00119
in scheme: TerminologyConceptScheme
top concept of: TerminologyConceptScheme