現金支出額
type: TerminologyConcept
description: 現金で買い物をしたとき、掛買い、月賦の支払を現金で行った場合、現金を預貯金した場合、借入金を現金で返済した場合、貸金した場合などの家計からの現金の支出額。消費税を含む。給料や賃金から直接差し引かれる税金、健康保険料、厚生年金保険料、雇用保険料、住宅・寮費、財形貯蓄などの控除を含む。
created: 2017-12-01
broader: Ta00026
in scheme: TerminologyConceptScheme
narrower: si323020097
narrower: si325020005
narrower: si243020044
narrower: si324020099
narrower: si323010079
narrower: si242020058
narrower: si242010058
narrower: si326020011
narrower: si324010011
narrower: si326010012
narrower: si243010042
narrower: si324010008
narrower: si326010011
narrower: si325010005
narrower: si323010081
narrower: si242020060
narrower: si243010044
narrower: si324020095
narrower: si326020012
narrower: si243020042
narrower: si242010060
narrower: si323020095
top concept of: TerminologyConceptScheme

RDF description of 現金支出額
primary topic: 現金支出額