現金支出の品名・用途
type: TerminologyConcept
in scheme: TerminologyConceptScheme
broader: Ta00580
narrower: si325020004
created: 2017-12-01
top concept of: TerminologyConceptScheme
narrower: si325010004
description: 現金で買い物をしたとき、掛買い、月賦の支払を現金で行った場合、現金を預貯金した場合、借入金を現金で返済した場合、貸金した場合などの支出したものの品名、用途（使用目的、使用者）。給料や賃金から直接差し引かれる税金、健康保険料、厚生年金保険料、雇用保険料、住宅・寮費、財形貯蓄などの控除も、現金支出とする。

RDF description of 現金支出の品名・用途
primary topic: 現金支出の品名・用途