減価償却費
type: TerminologyConcept
description: 土地以外の固定資産のうち、取得価額が10万円以上で耐用年数が１年以上のもの（減価償却資産）を取得した場合、一度に費用として処理せずに、定額法、定率法、級数法、生産高比例法などの計算方法により、使用可能期間（耐用年数）又は法定耐用年数に配分して費用計上した額。
created: 2017-12-01
broader: Ta00032
in scheme: TerminologyConceptScheme
top concept of: TerminologyConceptScheme

RDF description of 減価償却費
primary topic: 減価償却費