原材料費
type: TerminologyConcept
description: 研究のための原材料費のほか，試作品費，消耗器材費，実験用小動物のえさ代，外部に製作を依頼した試作品及び実験用模型などの費用。
created: 2017-12-01
broader: Ta00074
top concept of: TerminologyConceptScheme
in scheme: TerminologyConceptScheme

RDF description of 原材料費
primary topic: 原材料費