研修参加者数
type: TerminologyConcept
description: 教育委員会が前年度間に主催又は共催した社会教育関連事業のうち、社会教育の指導者を対象として実施した研修の参加者数。
created: 2017-12-01
broader: Ta00147
top concept of: TerminologyConceptScheme
in scheme: TerminologyConceptScheme

RDF description of 研修参加者数
primary topic: 研修参加者数