研究本務者数
type: TerminologyConcept
description: 調査対象である大学等に本務がある研究者の数。研究者とは、教員、大学院博士課程在学者、医局員又はその他の研究員（大学（短期大学を除く。）の課程を修了した者又はこれと同等以上の専門的知識を有する者で、特定のテーマを持って研究（事物、機能、現象などについて新知識を得るために、又は既存の知識の新しい活用の道を開くために行われる創造的な努力及び探求をいう。）を行っている者をいう。）のいずれかに該当する者をいう。その他の研究員で、学校に対して授業料等を納めている者は除く。
created: 2017-12-01
broader: Ta00116
top concept of: TerminologyConceptScheme
in scheme: TerminologyConceptScheme

RDF description of 研究本務者数
primary topic: 研究本務者数