研究補助者数Ａ
type: TerminologyConcept
description: 企業等、非営利団体・公的機関、大学等で実際に研究を行っている研究補助者の数。研究とは、事物、機能、現象などについて新知識を得るために、又は既存の知識の新しい活用の道を開くために行われる創造的な努力及び探求をいい、いわゆる学術的な研究のみならず、製品開発、既存製品の改良及び生産・製造工程の開発や改良に関する活動も含む。研究補助者とは、研究者以外の者で、研究者の指示に従い資料収集、検査・測定、試験、記録、経常的観測作業などに従事して、研究者を補助する者をいう。実際に研究を行っている研究補助者には、他の会社など別経営の事業所から派遣されている者（労働者派遣法にいう派遣労働者）、在籍出向など、他の会社など別経営の事業所に籍がありながら当該事業所に来て働いている者及び下請として他の会社など別経営の事業所で請け負った仕事を請負先である当該事業所に来て行っている者のうち、研究補助者を含む。他の会社など別経営の事業所へ派遣している者（労働者派遣法にいう派遣労働者）、在籍出向など当該事業所に籍がありながら他の会社など別経営の事業所で働いている者及び下請として当該事業所で請け負った仕事を請負先である他の会社など別経営の事業所で行っている者は除く。研究補助者の具体例として、ソフトウェア開発者のうち、研究者の設計に従い、コーディング作業のみを行っている者を含む。【平成25年2月 定義内容の変更】
created: 2017-12-01
broader: Ta00116
top concept of: TerminologyConceptScheme
in scheme: TerminologyConceptScheme

RDF description of 研究補助者数Ａ
primary topic: 研究補助者数Ａ