建物全体の階数_1
type: TerminologyConcept
narrower: si001010025
narrower: si001020022
description: 建物の階のうち、床が地盤面以上の高さにある階及び床が地盤面下にあり、床面から地盤面までの高さがその階の天井の高さの３分の１未満である階数。中２階や屋根裏部屋は除く。階数の定義は、建築基準法施行令第２条第１項第８号（昇降機、装飾塔、物見塔その他これらに類する建築物の屋上部分又は地階の倉庫、機械室その他これらに類す建築物の部分で、水平投影面積の合計がそれぞれ当該建築物の建築面積の八分の一以下のものは、当該建築物の階数に算入しない。また、建築物の一部が吹き抜けとなつている場合、建築物の敷地が斜面又は段地である場合その他建築物の部分によつて階数を異にする場合においては、これらの階数のうち最大のものによる。）による。
broader: Ta00394
created: 2017-12-01
in scheme: TerminologyConceptScheme
top concept of: TerminologyConceptScheme
narrower: si002010017

RDF description of 建物全体の階数_1
primary topic: 建物全体の階数_1