RDF description of 建物の構造_3
primary topic: 建物の構造_3

建物の構造_3
type: TerminologyConcept
description: 建物の構造を主要骨組の使用材料によって鉄筋コンクリート造、ブロック造、鉄骨造、木造に区分したもの。
created: 2017-12-01
broader: Ta00570
in scheme: TerminologyConceptScheme
top concept of: TerminologyConceptScheme