RDF description of 建物の構造_1
primary topic: 建物の構造_1

建物の構造_1
type: TerminologyConcept
in scheme: TerminologyConceptScheme
top concept of: TerminologyConceptScheme
narrower: si246010018
narrower: si246020018
narrower: si329010020
narrower: si329010033
narrower: si329020024
narrower: si329020039
broader: Ta00570
created: 2017-12-01
description: 建物の構造を木造、鉄筋・鉄骨コンクリート造などに区分したもの。建物が二つ以上の構造からなる場合は、占めている床面積の最も広い構造である。