RDF description of 建物の業務用面積
primary topic: 建物の業務用面積

建物の業務用面積
type: TerminologyConcept
description: 住居の延べ面積のうち、併用住宅の業務に用いるために設備された部分（商店の店舗部分、開業医の住宅の診察室、農業の作業場など）の面積。
created: 2017-12-01
broader: Ta00215
in scheme: TerminologyConceptScheme
narrower: si246010021
narrower: si246020021
top concept of: TerminologyConceptScheme