RDF description of 建物・構築物の資産額_3
primary topic: 建物・構築物の資産額_3

建物・構築物の資産額_3
type: TerminologyConcept
description: 建物（工場、事業所、社宅、その他経営附属物（構外のものを含む。）、附属設備（エレベータ、暖房・照明・通風設備など））や、構築物（ドック、橋、岸壁、さん橋、軌道、貯水池、坑道、煙突、その他土地に定着する土木設備、舗道、駐車場（減価償却の対象になるものに限る。））の購入、新築、増築、改築に要した費用、及び日よけ、給排水・ガス設備などに要した費用の額。取得価格や耐用年数の制限は定めていない。消費税、取得に要した運賃、裾付に要した費用などを含む。土地付き建物の場合は建物分のみの額。店舗併用住宅の場合、住居部分の建物分は除く。中古の建物の購入を含む。
created: 2017-12-01
broader: Ta00030
in scheme: TerminologyConceptScheme
top concept of: TerminologyConceptScheme