建築物の工事種別
type: TerminologyConcept
description: 建築工事届「（第二面）４．工事種別」から１．新築（既存の建築物のない新たな敷地に建築物を建てる工事）、２．増築（既存の建築物のある敷地内において床面積の合計が増加する工事）、３．改築（建築物の全部若しくは一部を除却し、引き続き用途、規模、構造の著しく異為らない建築物を建てる工事の該当する番号を記入する。
created: 2017-12-01
broader: Ta00652
in scheme: TerminologyConceptScheme
top concept of: TerminologyConceptScheme

RDF description of 建築物の工事種別
primary topic: 建築物の工事種別