RDF description of 建築時期_3
primary topic: 建築時期_3

建築時期_3
type: TerminologyConcept
in scheme: TerminologyConceptScheme
top concept of: TerminologyConceptScheme
broader: Ta00337
created: 2017-12-01
description: 建物が建築された年（西暦）。一部改修や増築した場合は当初の建築年とし、全部改築をした場合は、全部改築の年とする。