建築時期_1
type: TerminologyConcept
narrower: si246010026
narrower: si329010031
narrower: si329020032
narrower: si246020026
top concept of: TerminologyConceptScheme
narrower: si329010027
in scheme: TerminologyConceptScheme
broader: Ta00337
description: 住宅が完成した時期。建て増しや修繕をした場合は、その部分の床面積が、建て増しや改修後の住宅の床面積の合計の半分以上（建て増しや改修後の住宅の床面積が以前の住宅の床面積の２倍以上）であればその時期とし、半分より少なければ初めに建てた時期とする。古い住宅を壊して同じ敷地の中に新たに建て替えた場合は、建て替えた時期とする。住宅の内部を改造した場合は、その規模に関係なく、初めに建てた時期とする。住宅以外の建物を住宅に改造した場合は、改造した時期とする。建て増しをした部分が、常にその建て増し前の床面積より狭い場合は、初めに建てた時期とする。建築時期が違う２棟の建物で１住宅となる場合、床面積が広い方の建物の建築時期とする。中古住宅を購入した場合は、購入した時期ではなく、その建物が建築された時期とする。
narrower: si329020037
created: 2017-12-01

RDF description of 建築時期_1
primary topic: 建築時期_1