建設仮勘定の資産額_2
type: TerminologyConcept
description: 建物、構築物、機械、装置等の建設のために支出したもののうち、工事完成時まで仮勘定として処理されているものの額。
created: 2017-12-01
broader: Ta00030
top concept of: TerminologyConceptScheme
in scheme: TerminologyConceptScheme

RDF description of 建設仮勘定の資産額_2
primary topic: 建設仮勘定の資産額_2