健診・人間ドック等を受けなかった理由
type: TerminologyConcept
description: 過去１年間に健診等（健康診断、健康診査及び人間ドック）を受診したことがない場合、その理由。
created: 2017-12-01
broader: Ta00635
top concept of: TerminologyConceptScheme
in scheme: TerminologyConceptScheme

RDF description of 健診・人間ドック等を受けなかった理由
primary topic: 健診・人間ドック等を受けなかった理由