計算対象時期
type: TerminologyConcept
description: 繁殖用めす牛の対象畜が「初産」の場合は初回種付時、「経産牛」の場合は前回産子牛の販売月、調査期間中に経産牛を購入した場合は購入年月。
created: 2017-12-01
broader: Ta00344
top concept of: TerminologyConceptScheme
in scheme: TerminologyConceptScheme

RDF description of 計算対象時期
primary topic: 計算対象時期