経度
type: TerminologyConcept
description: 地球上の位置を示す座標。ある地点を通る子午線（経線）を含む面が、ロンドンの旧グリニッジ天文台をよぎる本初子午線を含む面となす角度で表す。グリニッジより東方に測る東経をプラスにとり、西側に測る西経をマイナスにとって、それぞれ一八〇度に至る。
created: 2017-12-01
broader: Ta00492
top concept of: TerminologyConceptScheme
in scheme: TerminologyConceptScheme

RDF description of 経度
primary topic: 経度