RDF description of 経営組織
primary topic: 経営組織

経営組織
type: TerminologyConcept
in scheme: TerminologyConceptScheme
top concept of: TerminologyConceptScheme
narrower: si187010010
narrower: si187020013
narrower: si246010010
narrower: si246020010
narrower: si329010011
narrower: si329020011
narrower: si408010024
narrower: si408020027
narrower: si409020027
narrower: si456010001
broader: Ta00572
created: 2017-12-01
description: 事業を経営している組織。主に用いられる区分として、民営か国、地方公共団体かの別、民営のうちの個人経営、法人、法人でない団体の別、法人のうちの会社か会社以外の法人かの別、会社の形態（株式会社、合名会社・合資会社、合同会社、相互会社、外国の会社）、会社以外の法人の形態などがある。