RDF description of 繰入重量
primary topic: 繰入重量

繰入重量
type: TerminologyConcept
in scheme: TerminologyConceptScheme
top concept of: TerminologyConceptScheme
broader: Ta00291
created: 2017-12-01
description: 前月から当月への繰入量を重量の単位（g、kg、t、鉛量t、純分換算kg、絶乾t、導体tなど）で表したもの。繰入量とは、前月の繰越量と同義であり、繰越量とは、生産者からの受入量、他工場・処理場からの受入量、前月からの繰入量の合計から、自工場での処理量、他工場・処理場への送出量を除いたものである。