給料の調整額
type: TerminologyConcept
description: 一般職の職員の給与に関する法律（昭和25年法律第95号）第10条及び人事院規則９－６（俸給の調整額）に定める俸給の調整額に相当する額で月を単位として支給される額。
created: 2017-12-01
broader: Ta00088
top concept of: TerminologyConceptScheme
in scheme: TerminologyConceptScheme

RDF description of 給料の調整額
primary topic: 給料の調整額