RDF description of 給料・最低保障額
primary topic: 給料・最低保障額

給料・最低保障額
type: TerminologyConcept
in scheme: TerminologyConceptScheme
top concept of: TerminologyConceptScheme
broader: Ta00088
created: 2017-12-01
description: 給料の額又は最低保障額。給料とは、固定給制又は固定給と歩合給の供用制のときの基本となるべき固定的給与。最低保障額とは、歩合給制の場合に水揚高の多少に関わりなく支払われることが保障されている報酬。