RDF description of 勤続年数_3
primary topic: 勤続年数_3

勤続年数_3
type: TerminologyConcept
description: 学校教育法に規定する学校（相当する外国の学校を含む。）の本務教員（市（区）町（組合）支弁の教員を含む。）、指導主事、旧視学又は旧視学官として勤務した実年数を合算したものとする。休職（休暇）・大学院修学休業中・産休中・育児休業中の期間や教員をもって充てる指導主事等で教育委員会等に勤務している期間は含める。兼務教員としての期間は除く。
created: 2017-12-01
broader: Ta00350
in scheme: TerminologyConceptScheme
top concept of: TerminologyConceptScheme