教員の異動の状況
type: TerminologyConcept
description: 高等学校以下の学校において、当該教員の調査対象期間の異動の状況が「採用（当該学校の本務教員として、高等学校以下の学校の本務教員以外の職業等から異動した者）」、「転入（高等学校以下の学校の本務教員から当該学校の本務教員として異動した者）」及び「離職（当該学校の本務教員でなくなった者）」のいずれに該当するかをいう。
created: 2017-12-01
broader: Ta00517
top concept of: TerminologyConceptScheme
in scheme: TerminologyConceptScheme

RDF description of 教員の異動の状況
primary topic: 教員の異動の状況