教育委員会事務局職員数A
type: TerminologyConcept
description: 教育委員会事務局の職員として発令されている者のうち、文部科学省生涯学習政策局及びスポーツ・青少年局青少年課の掌握事務に直結した諸事務を主として行っている社会教育関係課の職員のうち課長、社会教育主事、社会教育主事補及び派遣教育主事を除いた職員の人数。【平成28年8月 文部科学省に組織改編があったこと、及び「社会教育関係職員数」の区分に変更があったことにより、「社会教育関係職員数」に定義内容を変更】
created: 2017-12-01
broader: Ta00118
top concept of: TerminologyConceptScheme
in scheme: TerminologyConceptScheme

RDF description of 教育委員会事務局職員数A
primary topic: 教育委員会事務局職員数A