RDF description of 共済引受面積
primary topic: 共済引受面積

共済引受面積
type: TerminologyConcept
in scheme: TerminologyConceptScheme
top concept of: TerminologyConceptScheme
broader: Ta00183
created: 2017-12-01
description: 組合等と共済関係が成立している組合員等が、調査対象作物の耕作を行う耕地の面積で、共済加入申込書の栽培面積（組合等が当該申込書に記載された栽培面積に関し、承諾したものに限る。）をいう。