RDF description of 魚食普及活動実施主体
primary topic: 魚食普及活動実施主体

魚食普及活動実施主体
type: TerminologyConcept
in scheme: TerminologyConceptScheme
top concept of: TerminologyConceptScheme
broader: Ta00577
created: 2017-12-01
description: 過去１年間に漁業地区内において実施された魚食普及活動の実施主体。魚食普及活動とは、漁業地区内において、水産物の消費拡大と漁業への理解を深めてもらうことを目的として、魚の調理法の講習や料理実習、地域行事での魚料理出展やパネル展示等のイベントの実施、健康食品としてのＰＲ等の活動をいう。