漁網の所有形態
type: TerminologyConcept
description: 共同経営の漁網の所有形態。共有とは共同経営自身が所有する場合をいう。もちよりとは、出資者がそれぞれ持ち寄った場合をいう。借入れとは、他から借り入れた場合をいい、出資者に賃借料を払って借り入れた場合も含む。
created: 2017-12-01
broader: Ta00615
top concept of: TerminologyConceptScheme
in scheme: TerminologyConceptScheme

RDF description of 漁網の所有形態
primary topic: 漁網の所有形態